Target
Aromatase
Ligand
BDBM13061
Substrate
Meas. Tech.
ChEMBL_1521503 (CHEMBL3627341)
IC50
0.890000±n/a nM
Citation
 Thomas, MPPotter, BV Discovery and Development of the Aryl O-Sulfamate Pharmacophore for Oncology and Women's Health. J Med Chem 58:7634-58 (2015)  
Target
Name:
Aromatase
Synonyms:
ARO1 CP19A_HUMAN CYP19 CYPXIX Cytochrome P450 19A1 Cytochrome P450-C19 (CYP19) FL cytokine receptor precursor | P-450AROM
Type:
Enzyme
Mol. Mass.:
57888.92
Organism:
Homo sapiens (Human)
Description:
P11511
Residue:
503
  
Inhibitor
Name:
BDBM13061
Synonyms:
4,4 -(1H-1,2,4-triazol-1-ylmethanediyl)dibenzonitrile CHEMBL1444 | Letrozole
Type:
Small organic molecule
Emp. Form.:
C17H11N5
Mol. Mass.:
285.3027
SMILES:
N#Cc1ccc(cc1)C(c1ccc(cc1)C#N)n1cncn1
: