Target
Steryl-sulfatase
Ligand
BDBM50121116
Substrate
Meas. Tech.
ChEMBL_1521478 (CHEMBL3627275)
IC50
1.000000±n/a nM
Citation
 Thomas, MPPotter, BV Discovery and Development of the Aryl O-Sulfamate Pharmacophore for Oncology and Women's Health. J Med Chem 58:7634-58 (2015)  
Target
Name:
Steryl-sulfatase
Synonyms:
ARSC1 Arylsulfatase C STS_HUMAN Steryl-sulfate sulfohydrolase
Type:
Enzyme
Mol. Mass.:
65503.66
Organism:
Homo sapiens (Human)
Description:
P08842
Residue:
583
  
Inhibitor
Name:
BDBM50121116
Synonyms:
CHEMBL3622021
Type:
Small organic molecule
Emp. Form.:
C21H28N2O5S
Mol. Mass.:
420.522
SMILES:
[H][C@]12CC[C@]3(C)C(=O)N(CCC)C(=O)C[C@@]3([H])[C@]1([H])CCc1cc(OS(N)(=O)=O)ccc21
: