Target
Metabotropic glutamate receptor 2
Ligand
BDBM50121655
Substrate
Meas. Tech.
ChEMBL_1518586 (CHEMBL3619269)
Ki
60±n/a nM
Citation
 Monn, JAPrieto, LTaboada, LHao, JReinhard, MRHenry, SSBeadle, CDWalton, LMan, TRudyk, HClark, BTupper, DBaker, SRLamas, CMontero, CMarcos, ABlanco, JBures, MClawson, DKAtwell, SLu, FWang, JRussell, MHeinz, BAWang, XCarter, JHGetman, BGCatlow, JTSwanson, SJohnson, BGShaw, DBMcKinzie, DL Synthesis and Pharmacological Characterization of C4-(Thiotriazolyl)-substituted-2-aminobicyclo[3.1.0]hexane-2,6-dicarboxylates. Identification of (1R,2S,4R,5R,6R)-2-Amino-4-(1H-1,2,4-triazol-3-ylsulfanyl)bicyclo[3.1.0]hexane-2,6-dicarboxylic Acid (LY2812223), a Highly Potent, Functionally Selective J Med Chem 58:7526-48 (2015)  
Target
Name:
Metabotropic glutamate receptor 2
Synonyms:
GPRC1B GRM2_HUMAN Metabotropic glutamate receptor mGlu2 | metabotropic glutamate 2
Type:
Enzyme
Mol. Mass.:
95584.88
Organism:
Homo sapiens (Human)
Description:
Q14416
Residue:
872
  
Inhibitor
Name:
BDBM50121655
Synonyms:
CHEMBL3616854
Type:
Small organic molecule
Emp. Form.:
C10H12N4O4S
Mol. Mass.:
284.292
SMILES:
[H][C@]12[C@H](C(O)=O)[C@@]1([H])[C@@](N)(C[C@@H]2Sc1nnc[nH]1)C(O)=O
: