Target
cAMP-specific 3',5'-cyclic phosphodiesterase 4B
Ligand
BDBM14361
Substrate
Meas. Tech.
ChEMBL_1517017 (CHEMBL3619476)
IC50
1300±n/a nM
Citation
 Song, GZhao, DHu, DLi, YJin, HCui, Z Design, synthesis and biological evaluation of novel tetrahydroisoquinoline derivatives as potential PDE4 inhibitors. Bioorg Med Chem Lett 25:4610-4 (2015)  
Target
Name:
cAMP-specific 3',5'-cyclic phosphodiesterase 4B
Synonyms:
3',5'-cyclic phosphodiesterase Isoform PDE4B1 PDE4B PDE4B_HUMAN Phosphodiesterase 4B (PDE4B) Phosphodiesterase Type 4 (PDE4B)
Type:
Protein
Mol. Mass.:
83318.87
Organism:
Homo sapiens (Human)
Description:
Q07343
Residue:
736
  
Inhibitor
Name:
BDBM14361
Synonyms:
(R,S)-Rolipram 4-[3-(cyclopentyloxy)-4-methoxyphenyl]pyrrolidin-2-one CHEMBL63 | Rolipram
Type:
Small organic molecule
Emp. Form.:
C16H21NO3
Mol. Mass.:
275.3428
SMILES:
COc1ccc(cc1OC1CCCC1)C1CNC(=O)C1
: