Target
Flap endonuclease 1
Ligand
BDBM50121871
Substrate
Meas. Tech.
ChEMBL_1517026 (CHEMBL3619485)
IC50
23300±n/a nM
Citation
 Chapman, TMWallace, CGillen, KJBakrania, PKhurana, PCoombs, PJFox, SBureau, EABrownlees, JMelton, DWSaxty, B N-Hydroxyimides and hydroxypyrimidinones as inhibitors of the DNA repair complex ERCC1-XPF. Bioorg Med Chem Lett 25:4104-8 (2015)  
Target
Name:
Flap endonuclease 1
Synonyms:
DNase IV FEN1 Flap structure-specific endonuclease 1 Maturation factor 1 hFEN-1
Type:
PROTEIN
Mol. Mass.:
42602.57
Organism:
Homo sapiens (Human)
Description:
ChEMBL_1517026
Residue:
380
  
Inhibitor
Name:
BDBM50121871
Synonyms:
CHEMBL223338
Type:
Small organic molecule
Emp. Form.:
C9H7N3O3S
Mol. Mass.:
237.235
SMILES:
NC(=O)c1nc(nc(O)c1O)-c1cccs1
: