Target
Death-associated protein kinase 1
Ligand
BDBM23416
Substrate
Meas. Tech.
ChEMBL_1517176 (CHEMBL3620066)
IC50
>300000±n/a nM
Citation
 Yokoyama, TKosaka, YMizuguchi, M Structural Insight into the Interactions between Death-Associated Protein Kinase 1 and Natural Flavonoids. J Med Chem 58:7400-8 (2015)  
Target
Name:
Death-associated protein kinase 1
Synonyms:
Cellular tumor antigen p53/Death-associated protein kinase 1 DAPK DAPK1_HUMAN Death-associated protein kinase 1 (DAPK1) Death-associated protein kinase 3 (DAPK3)
Type:
PROTEIN
Mol. Mass.:
160053.35
Organism:
Homo sapiens (Human)
Description:
ChEMBL_1517177
Residue:
1430
  
Inhibitor
Name:
BDBM23416
Synonyms:
α-CA inhibitor, 3 (2R,3S)-2-(3,4-dihydroxyphenyl)-3,4-dihydro-2H-1-benzopyran-3,5,7-triol Catechin | D-Catechin
Type:
Flavonol
Emp. Form.:
C15H14O6
Mol. Mass.:
290.2681
SMILES:
O[C@H]1Cc2c(O)cc(O)cc2O[C@@H]1c1ccc(O)c(O)c1
: