Target
RCG38204, isoform CRA_d
Ligand
BDBM50121995
Substrate
Meas. Tech.
ChEMBL_1517183 (CHEMBL3620073)
Ki
65900±n/a nM
Citation
 Katane, MYamada, SKawaguchi, GChinen, MMatsumura, MAndo, TDoi, INakayama, KKaneko, YMatsuda, SSaitoh, YMiyamoto, TSekine, MYamaotsu, NHirono, SHomma, H Identification of Novel D-Aspartate Oxidase Inhibitors by in Silico Screening and Their Functional and Structural Characterization in Vitro. J Med Chem 58:7328-40 (2015)  
Target
Name:
RCG38204, isoform CRA_d
Synonyms:
D-aspartate oxidase Ensembl:ENSRNOP00000000710 Protein Ddo RGD:1595123
Type:
PROTEIN
Mol. Mass.:
37549.70
Organism:
Rattus norvegicus
Description:
ChEMBL_109876
Residue:
341
  
Inhibitor
Name:
BDBM50121995
Synonyms:
CHEMBL3617316
Type:
Small organic molecule
Emp. Form.:
C6H4N4O3
Mol. Mass.:
180.121
SMILES:
OC(=O)c1cn2cnnc2nc1O
: