Target
D-aspartate oxidase
Ligand
BDBM14673
Substrate
Meas. Tech.
ChEMBL_1517182 (CHEMBL3620072)
Ki
153000±n/a nM
Citation
 Katane, MYamada, SKawaguchi, GChinen, MMatsumura, MAndo, TDoi, INakayama, KKaneko, YMatsuda, SSaitoh, YMiyamoto, TSekine, MYamaotsu, NHirono, SHomma, H Identification of Novel D-Aspartate Oxidase Inhibitors by in Silico Screening and Their Functional and Structural Characterization in Vitro. J Med Chem 58:7328-40 (2015)  
Target
Name:
D-aspartate oxidase
Synonyms:
D-Aspartate Oxidase (DDO) DDO | OXDD_HUMAN
Type:
Oxidoreductase
Mol. Mass.:
37543.06
Organism:
Homo sapiens (Human)
Description:
Recombinant human DDO expressed and purified from sf9 insect cells, was used in enzyme assays.
Residue:
341
  
Inhibitor
Name:
BDBM14673
Synonyms:
Fragment 3 propanedioic acid
Type:
Small organic molecule
Emp. Form.:
C3H4O4
Mol. Mass.:
104.0615
SMILES:
OC(=O)CC(O)=O
: