Target
Tyrosine-protein kinase JAK1
Ligand
BDBM50122319
Substrate
Meas. Tech.
ChEMBL_1518839 (CHEMBL3625645)
IC50
16±n/a nM
Citation
 Wan, HSchroeder, GMHart, ACInghrim, JGrebinski, JTokarski, JSLorenzi, MVYou, DMcdevitt, TPenhallow, BVuppugalla, RZhang, YGu, XIyer, RLombardo, LJTrainor, GLRuepp, SLippy, JBlat, YSack, JSKhan, JAStefanski, KSleczka, BMathur, ASun, JHWong, MKWu, DRLi, PGupta, AArunachalam, PNPragalathan, BNarayanan, SK C, NKuppusamy, PPurandare, AV Discovery of a Highly Selective JAK2 Inhibitor, BMS-911543, for the Treatment of Myeloproliferative Neoplasms. ACS Med Chem Lett 6:850-5 (2015)  
Target
Name:
Tyrosine-protein kinase JAK1
Synonyms:
JAK-1 JAK1A JAK1_HUMAN Janus kinase 1 (JAK1) | Janus kinase 1 JAK1
Type:
Protein
Mol. Mass.:
133293.73
Organism:
Homo sapiens (Human)
Description:
P23458
Residue:
1154
  
Inhibitor
Name:
BDBM50122319
Synonyms:
CHEMBL3622150
Type:
Small organic molecule
Emp. Form.:
C22H26N8O
Mol. Mass.:
418.4948
SMILES:
CCn1c(cc2c1nc(Nc1cc(C)[nH]n1)c1ncn(C)c21)C(=O)N(C1CC1)C1CC1
: