Target
Polymerase acidic protein
Ligand
BDBM50390688
Substrate
Meas. Tech.
ChEMBL_1519446 (CHEMBL3625380)
IC50
940±n/a nM
Citation
 Pala, NStevaert, ADallocchio, RDessė, ARogolino, DCarcelli, MSanna, VSechi, MNaesens, L Virtual Screening and Biological Validation of Novel Influenza Virus PA Endonuclease Inhibitors. ACS Med Chem Lett 6:866-71 (2015)  
Target
Name:
Polymerase acidic protein
Synonyms:
PA Polymerase acidic protein | RNA-directed RNA polymerase subunit P2
Type:
PROTEIN
Mol. Mass.:
82546.82
Organism:
Influenza A virus (strain A/X-31 H3N2)
Description:
ChEMBL_109885
Residue:
716
  
Inhibitor
Name:
BDBM50390688
Synonyms:
CHEMBL2070214
Type:
Small organic molecule
Emp. Form.:
C17H16N2O5
Mol. Mass.:
328.3193
SMILES:
Oc1ccc(CCNC(=O)c2cc3cc(O)c(O)cc3[nH]2)cc1O
: