Target
Oxysterols receptor LXR-alpha/LXR-beta
Ligand
BDBM19993
Substrate
Meas. Tech.
ChEMBL_1519735 (CHEMBL3624214)
IC50
26000±n/a nM
Citation
 Nomura, SEndo-Umeda, KAoyama, AMakishima, MHashimoto, YIshikawa, M Styrylphenylphthalimides as Novel Transrepression-Selective Liver X Receptor (LXR) Modulators. ACS Med Chem Lett 6:902-7 (2015)  
Target
Name:
Oxysterols receptor LXR-alpha/LXR-beta
Synonyms:
Liver X receptor
Type:
Mol. Mass.:
Description:
ASSAY_ID of ChEMBL is 1519735
Components:
This complex has 2 components.
Component 1
Name:
Oxysterols receptor LXR-beta
Synonyms:
LXRB Liver X, LXR beta NR1H2 Nuclear receptor NER Ubiquitously-expressed nuclear receptor
Type:
Enzyme Catalytic Domain
Mol. Mass.:
50978.79
Organism:
Homo sapiens (Human)
Description:
P55055
Residue:
460
  
Component 2
Name:
Oxysterols receptor LXR-alpha
Synonyms:
LXRA Liver X receptor alpha Liver X receptor alpha (NR1H3) NR1H3 Nuclear orphan receptor LXR-alpha | Nuclear receptor subfamily 1 group H member 3
Type:
Enzyme Catalytic Domain
Mol. Mass.:
50403.85
Organism:
Homo sapiens (Human)
Description:
Q13133
Residue:
447
  
Inhibitor
Name:
BDBM19993
Synonyms:
CHEMBL62136 T 0901317 TO-901317 US10669296, Compound TO901317 [3H]T0901317
Type:
Small organic molecule
Emp. Form.:
C17H12F9NO3S
Mol. Mass.:
481.333
SMILES:
OC(c1ccc(cc1)N(CC(F)(F)F)S(=O)(=O)c1ccccc1)(C(F)(F)F)C(F)(F)F
: