Target
Androgen receptor
Ligand
BDBM50122639
Substrate
Meas. Tech.
ChEMBL_1519754 (CHEMBL3624233)
Ki
31±n/a nM
Citation
 Balog, ARampulla, RMartin, GSKrystek, SRAttar, RDell-John, JDiMarco, JDFairfax, DGougoutas, JHolst, CLNation, ARizzo, CRossiter, LMSchweizer, LShan, WSpergel, SSpires, TCornelius, GGottardis, MTrainor, GVite, GDSalvati, ME Discovery of BMS-641988, a Novel Androgen Receptor Antagonist for the Treatment of Prostate Cancer. ACS Med Chem Lett 6:908-12 (2015)  
Target
Name:
Androgen receptor
Synonyms:
ANDR_HUMAN Androgen Receptor Androgen receptor/Baculoviral IAP repeat-containing protein 2 Dihydrotestosterone receptor Nuclear receptor subfamily 3 group C member 4
Type:
Receptor
Mol. Mass.:
99185.27
Organism:
Homo sapiens (Human)
Description:
CHO cells were stably transfected with human AR gene.
Residue:
920
  
Inhibitor
Name:
BDBM50122639
Synonyms:
CHEMBL3623118
Type:
Small organic molecule
Emp. Form.:
C18H16F3N3O3
Mol. Mass.:
379.3331
SMILES:
[H][C@]12C(=O)N(C(=O)[C@@]1([H])[C@@]1(C)O[C@]2(C)C[C@H]1N)c1ccc(C#N)c(c1)C(F)(F)F
: