Target
Mitogen-activated protein kinase kinase kinase kinase 4
Ligand
BDBM50122729
Substrate
Meas. Tech.
ChEMBL_1519919 (CHEMBL3624922)
IC50
15±n/a nM
Citation
 Ndubaku, COCrawford, TDChen, HBoggs, JWDrobnick, JHarris, SFJesudason, RMcNamara, ENonomiya, JSambrone, ASchmidt, SSmyczek, TVitorino, PWang, LWu, PYeung, SChen, JChen, KDing, CZWang, TXu, ZGould, SEMurray, LJYe, W Structure-Based Design of GNE-495, a Potent and Selective MAP4K4 Inhibitor with Efficacy in Retinal Angiogenesis. ACS Med Chem Lett 6:913-8 (2015)  
Target
Name:
Mitogen-activated protein kinase kinase kinase kinase 4
Synonyms:
HGK KIAA0687 MAP4K4 MAPK/ERK kinase kinase kinase 4 MEKKK 4 NIK | Nck-interacting kinase
Type:
Serine/threonine-protein kinase
Mol. Mass.:
142114.73
Organism:
Homo sapiens (Human)
Description:
O95819
Residue:
1239
  
Inhibitor
Name:
BDBM50122729
Synonyms:
CHEMBL3623134
Type:
Small organic molecule
Emp. Form.:
C21H20FN5O2
Mol. Mass.:
393.4142
SMILES:
CNC(=O)N1CC(C1)NC(=O)c1cnc(N)c2cc(ccc12)-c1cccc(F)c1
: