Target
Aromatase
Ligand
BDBM50123024
Substrate
Meas. Tech.
ChEMBL_1520471 (CHEMBL3624600)
IC50
41±n/a nM
Citation
 Ahmad, IShagufta, na Recent developments in steroidal and nonsteroidal aromatase inhibitors for the chemoprevention of estrogen-dependent breast cancer. Eur J Med Chem 102:375-86 (2015)  
Target
Name:
Aromatase
Synonyms:
ARO1 CP19A_HUMAN CYP19 CYPXIX Cytochrome P450 19A1 Cytochrome P450-C19 (CYP19) FL cytokine receptor precursor | P-450AROM
Type:
Enzyme
Mol. Mass.:
57888.92
Organism:
Homo sapiens (Human)
Description:
P11511
Residue:
503
  
Inhibitor
Name:
BDBM50123024
Synonyms:
CHEMBL3623227
Type:
Small organic molecule
Emp. Form.:
C18H15FN2O
Mol. Mass.:
294.3229
SMILES:
Fc1ccc2C(CC(Oc2c1)c1ccccc1)n1ccnc1
: