Target
Aromatase
Ligand
BDBM50123151
Substrate
Meas. Tech.
ChEMBL_1520466 (CHEMBL3624595)
IC50
470±n/a nM
Citation
 Ahmad, IShagufta, na Recent developments in steroidal and nonsteroidal aromatase inhibitors for the chemoprevention of estrogen-dependent breast cancer. Eur J Med Chem 102:375-86 (2015)  
Target
Name:
Aromatase
Synonyms:
ARO1 CP19A_HUMAN CYP19 CYPXIX Cytochrome P450 19A1 Cytochrome P450-C19 (CYP19) FL cytokine receptor precursor | P-450AROM
Type:
Enzyme
Mol. Mass.:
57888.92
Organism:
Homo sapiens (Human)
Description:
P11511
Residue:
503
  
Inhibitor
Name:
BDBM50123151
Synonyms:
CHEMBL3623223
Type:
Small organic molecule
Emp. Form.:
C22H28O2
Mol. Mass.:
324.4565
SMILES:
[H][C@@]12CCC(=O)[C@@]1(C)CC[C@@]1([H])[C@@]2([H])[C@H](CC=C)CC2=CC(=O)C=C[C@]12C
: