Target
Aromatase
Ligand
BDBM9461
Substrate
Meas. Tech.
ChEMBL_1520466 (CHEMBL3624595)
IC50
113000±n/a nM
Citation
 Ahmad, IShagufta, na Recent developments in steroidal and nonsteroidal aromatase inhibitors for the chemoprevention of estrogen-dependent breast cancer. Eur J Med Chem 102:375-86 (2015)  
Target
Name:
Aromatase
Synonyms:
ARO1 CP19A_HUMAN CYP19 CYPXIX Cytochrome P450 19A1 Cytochrome P450-C19 (CYP19) FL cytokine receptor precursor | P-450AROM
Type:
Enzyme
Mol. Mass.:
57888.92
Organism:
Homo sapiens (Human)
Description:
P11511
Residue:
503
  
Inhibitor
Name:
BDBM9461
Synonyms:
5,7-dihydroxy-3-(4-methoxyphenyl)-4H-chromen-4-one Biochanin A (BCA) CHEMBL131921 | cid_5280373
Type:
Small organic molecule
Emp. Form.:
C16H12O5
Mol. Mass.:
284.2635
SMILES:
COc1ccc(cc1)-c1coc2cc(O)cc(O)c2c1=O
: