Target
NAD-dependent protein deacylase sirtuin-6
Ligand
BDBM50123401
Substrate
Meas. Tech.
ChEMBL_1520800 (CHEMBL3625954)
IC50
275000±n/a nM
Citation
 Sociali, GGaleno, LParenti, MDGrozio, ABauer, IPassalacqua, MBoero, SDonadini, AMillo, EBellotti, MSturla, LDamonte, PPuddu, AFerroni, CVarchi, GFranceschi, CBallestrero, APoggi, ABruzzone, SNencioni, ADel Rio, A Quinazolinedione SIRT6 inhibitors sensitize cancer cells to chemotherapeutics. Eur J Med Chem 102:530-9 (2015)  
Target
Name:
NAD-dependent protein deacylase sirtuin-6
Synonyms:
NAD-dependent protein deacetylase sirtuin-6 Regulatory protein SIR2 homolog 6 SIR2L6 SIRT6 | Sirtuin-6 (SIRT6)
Type:
Protein
Mol. Mass.:
39133.03
Organism:
Homo sapiens (Human)
Description:
Q8N6T7
Residue:
355
  
Inhibitor
Name:
BDBM50123401
Synonyms:
CHEMBL3623257
Type:
Small organic molecule
Emp. Form.:
C20H17N3O4S
Mol. Mass.:
395.432
SMILES:
O=C1CCc2cc(ccc2N1)S(=O)(=O)Nc1ccc(Oc2cccnc2)cc1
: