Target
DNA topoisomerase 1
Ligand
BDBM50114772
Substrate
Meas. Tech.
ChEMBL_1520827 (CHEMBL3626095)
EC50
>100000±n/a nM
Citation
 Majumdar, PBathula, CBasu, SMDas, SKAgarwal, RHati, SSingh, ASen, SDas, BB Design, synthesis and evaluation of thiohydantoin derivatives as potent topoisomerase I (Top1) inhibitors with anticancer activity. Eur J Med Chem 102:540-51 (2015)  
Target
Name:
DNA topoisomerase 1
Synonyms:
DNA topoisomerase I TOP1 | TOP1_HUMAN
Type:
Enzyme
Mol. Mass.:
90771.02
Organism:
Homo sapiens (Human)
Description:
P11387
Residue:
765
  
Inhibitor
Name:
BDBM50114772
Synonyms:
CHEMBL3623273
Type:
Small organic molecule
Emp. Form.:
C14H11N3O3S
Mol. Mass.:
301.32
SMILES:
COc1ccc(cn1)-c1csc(\C=C2\NC(=O)NC2=O)c1
: