Target
Histone deacetylase 1
Ligand
BDBM19149
Substrate
Meas. Tech.
ChEMBL_1522021 (CHEMBL3627128)
IC50
89±n/a nM
Citation
 Yao, YTu, ZLiao, CWang, ZLi, SYao, HLi, ZJiang, S Discovery of Novel Class I Histone Deacetylase Inhibitors with Promising in Vitro and in Vivo Antitumor Activities. J Med Chem 58:7672-80 (2015)  
Target
Name:
Histone deacetylase 1
Synonyms:
Cereblon/Histone deacetylase 1 HDAC1 Histone deacetylase 1 (HDAC1) RPD3L1
Type:
Enzyme
Mol. Mass.:
55090.27
Organism:
Homo sapiens (Human)
Description:
Q13547
Residue:
482
  
Inhibitor
Name:
BDBM19149
Synonyms:
CHEMBL98 SAHA US10188756, Compound SAHA US11505523, Compound SAHA US9353061, SAHA US9695181, Vorinostat Zolinza suberoylanilide hydroxamic acid
Type:
Small organic molecule
Emp. Form.:
C14H20N2O3
Mol. Mass.:
264.3202
SMILES:
ONC(=O)CCCCCCC(=O)Nc1ccccc1
: