Target
Polyunsaturated fatty acid lipoxygenase ALOX15
Ligand
BDBM50123745
Substrate
Meas. Tech.
ChEMBL_1522060 (CHEMBL3627220)
Ki
1.000000±n/a nM
Citation
 Eleftheriadis, NNeochoritis, CGLeus, NGvan der Wouden, PEDömling, ADekker, FJ Rational Development of a Potent 15-Lipoxygenase-1 Inhibitor with in Vitro and ex Vivo Anti-inflammatory Properties. J Med Chem 58:7850-62 (2015)  
Target
Name:
Polyunsaturated fatty acid lipoxygenase ALOX15
Synonyms:
15-Lipoxygenase-1 (15-LOX-1) Arachidonate 15-lipoxygenase LOG15 Reticulocyte 15-lipoxygenase-1 | Sphingosine 1-phosphate receptor 1 (S1P1)
Type:
Protein
Mol. Mass.:
74804.05
Organism:
Homo sapiens (Human)
Description:
Residue:
662
  
Inhibitor
Name:
BDBM50123745
Synonyms:
CHEMBL3622746
Type:
Small organic molecule
Emp. Form.:
C27H32FN7O2S2
Mol. Mass.:
569.717
SMILES:
CCN([C@H]1CCN(C1)C(C)c1ccc(F)cc1)S(=O)(=O)NCCc1c(n[nH]c1-c1cnccn1)-c1cccs1
: