Target
LIM domain kinase 1
Ligand
BDBM50124403
Substrate
Meas. Tech.
ChEMBL_1520362 (CHEMBL3624100)
IC50
327±n/a nM
Citation
 Charles, MDBrookfield, JLEkwuru, TCStockley, MDunn, JRiddick, MHammonds, TTrivier, EGreenland, GWong, ACCheasty, ABoyd, SCrighton, DOlson, MF Discovery, Development, and SAR of Aminothiazoles as LIMK Inhibitors with Cellular Anti-Invasive Properties. J Med Chem 58:8309-13 (2015)  
Target
Name:
LIM domain kinase 1
Synonyms:
LIMK LIMK1 | LIMK1_HUMAN
Type:
Enzyme Catalytic Domain
Mol. Mass.:
72591.81
Organism:
Homo sapiens (Human)
Description:
gi_4505001
Residue:
647
  
Inhibitor
Name:
BDBM50124403
Synonyms:
CHEMBL3623445
Type:
Small organic molecule
Emp. Form.:
C17H16ClN3S
Mol. Mass.:
329.847
SMILES:
CCCNc1ncc(s1)-c1cccnc1-c1ccccc1Cl
: