Target
Integrin alpha-2/beta-3
Ligand
BDBM50063698
Substrate
Meas. Tech.
ChEMBL_1520713 (CHEMBL3625632)
IC50
12500±n/a nM
Citation
 Polishchuk, PGSamoylenko, GVKhristova, TMKrysko, OLKabanova, TAKabanov, VMKornylov, AYKlimchuk, OLanger, TAndronati, SAKuz'min, VEKrysko, AAVarnek, A Design, Virtual Screening, and Synthesis of Antagonists ofaIIbß3 as Antiplatelet Agents. J Med Chem 58:7681-94 (2015)  
Target
Name:
Integrin alpha-2/beta-3
Synonyms:
Type:
Mol. Mass.:
Description:
ASSAY_ID of EBI is 770669
Components:
This complex has 2 components.
Component 1
Name:
Integrin beta-3
Synonyms:
CD_antigen=CD61 GPIIIa ITGB3 Platelet membrane glycoprotein IIIa
Type:
Protein
Mol. Mass.:
87038.91
Organism:
Homo sapiens (Human)
Description:
P05106
Residue:
788
  
Component 2
Name:
Integrin alpha-2
Synonyms:
CD49B Collagen receptor ITA2_HUMAN Integrin alpha-2 precursor Platelet membrane glycoprotein Ia | VLA-2 alpha chain
Type:
Single-pass type I membrane protein
Mol. Mass.:
129273.27
Organism:
Homo sapiens (Human)
Description:
Residue:
1181
  
Inhibitor
Name:
BDBM50063698
Synonyms:
4-Guanidino-benzoic acid 6-carbamimidoyl-naphthalen-2-yl ester CHEMBL273264 | Nafamostat
Type:
Small organic molecule
Emp. Form.:
C19H17N5O2
Mol. Mass.:
347.3706
SMILES:
[#7]\[#6](-[#7])=[#7]/c1ccc(cc1)-[#6](=O)-[#8]-c1ccc2cc(ccc2c1)-[#6](-[#7])=[#7]
: