Target
Prostaglandin G/H synthase 1
Ligand
BDBM50124575
Substrate
Meas. Tech.
ChEMBL_1520858 (CHEMBL3626243)
IC50
1800±n/a nM
Citation
 Hendriks, CMPenning, TMZang, TWiemuth, DGründer, SSanhueza, IASchoenebeck, FBolm, C Pentafluorosulfanyl-containing flufenamic acid analogs: Syntheses, properties and biological activities. Bioorg Med Chem Lett 25:4437-40 (2015)  
Target
Name:
Prostaglandin G/H synthase 1
Synonyms:
COX-1 Cyclooxygenase Cyclooxygenase-1 (COX-1) PTGS1 | Prostaglandin G/H synthase (cyclooxygenase)
Type:
Enzyme
Mol. Mass.:
68692.62
Organism:
Homo sapiens (Human)
Description:
P23219
Residue:
599
  
Inhibitor
Name:
BDBM50124575
Synonyms:
CHEMBL3623735
Type:
Small organic molecule
Emp. Form.:
C13H10F5NO2S
Mol. Mass.:
339.281
SMILES:
OC(=O)c1ccccc1Nc1cccc(c1)S(F)(F)(F)(F)F
: