Target
Acetylcholinesterase
Ligand
BDBM50124883
Substrate
Meas. Tech.
ChEMBL_1521650 (CHEMBL3626450)
IC50
848±n/a nM
Citation
 Camerino, EWong, DMTong, FKörber, FGross, ADIslam, RViayna, EMutunga, JMLi, JTotrov, MMBloomquist, JRCarlier, PR Difluoromethyl ketones: Potent inhibitors of wild type and carbamate-insensitive G119S mutant Anopheles gambiae acetylcholinesterase. Bioorg Med Chem Lett 25:4405-11 (2015)  
Target
Name:
Acetylcholinesterase
Synonyms:
ACE1 ACES_ANOGA AChE Acetylcholinesterase
Type:
PROTEIN
Mol. Mass.:
80902.47
Organism:
Anopheles gambiae
Description:
ChEMBL_104567
Residue:
737
  
Inhibitor
Name:
BDBM50124883
Synonyms:
CHEMBL3137700
Type:
Small organic molecule
Emp. Form.:
C11H13F3OSi
Mol. Mass.:
246.301
SMILES:
C[Si](C)(C)c1cccc(c1)C(=O)C(F)(F)F
: