Target
Acetylcholinesterase
Ligand
BDBM50124872
Substrate
Meas. Tech.
ChEMBL_1521650 (CHEMBL3626450)
IC50
1.0±n/a nM
Citation
 Camerino, EWong, DMTong, FKörber, FGross, ADIslam, RViayna, EMutunga, JMLi, JTotrov, MMBloomquist, JRCarlier, PR Difluoromethyl ketones: Potent inhibitors of wild type and carbamate-insensitive G119S mutant Anopheles gambiae acetylcholinesterase. Bioorg Med Chem Lett 25:4405-11 (2015)  
Target
Name:
Acetylcholinesterase
Synonyms:
ACE1 ACES_ANOGA AChE Acetylcholinesterase
Type:
PROTEIN
Mol. Mass.:
80902.47
Organism:
Anopheles gambiae
Description:
ChEMBL_104567
Residue:
737
  
Inhibitor
Name:
BDBM50124872
Synonyms:
CHEMBL3623558
Type:
Small organic molecule
Emp. Form.:
C10H14F2N2O
Mol. Mass.:
216.2278
SMILES:
CCC(CC)n1cc(cn1)C(=O)C(F)F
: