Target
Kallikrein-7
Ligand
BDBM50125021
Substrate
Meas. Tech.
ChEMBL_1522076 (CHEMBL3627281)
Ki
0.800000±n/a nM
Citation
 de Veer, SJWang, CKHarris, JMCraik, DJSwedberg, JE Improving the Selectivity of Engineered Protease Inhibitors: Optimizing the P2 Prime Residue Using a Versatile Cyclic Peptide Library. J Med Chem 58:8257-68 (2015)  
Target
Name:
Kallikrein-7
Synonyms:
KLK7 Kallikrein 7 PRSS6 Serine protease 6 hK7 kallikrein-7 isoform 1 preproprotein
Type:
PROTEIN
Mol. Mass.:
27535.05
Organism:
Homo sapiens (Human)
Description:
ChEMBL_1469257
Residue:
253
  
Inhibitor
Name:
BDBM50125021
Synonyms:
CHEMBL3623779
Type:
Small organic molecule
Emp. Form.:
C58H92N20O20S2
Mol. Mass.:
1453.603
SMILES:
[H][C@@]12CCCN1C(=O)[C@H](CC(N)=O)NC(=O)[C@]1([H])CSSC[C@]([H])(NC(=O)[C@@]([H])(NC(=O)CNC(=O)[C@H](CC(N)=O)NC2=O)[C@@H](C)O)C(=O)N[C@@]([H])([C@@H](C)O)C(=O)N[C@@H](CCCNC(N)=N)C(=O)N[C@@H](CO)C(=O)N[C@@H](CC(N)=O)C(=O)N2CCC[C@@]2([H])C(=O)N2CCC[C@@]2([H])C(=O)N[C@@]([H])([C@@H](C)CC)C(=O)N1
: