Target
Cytochrome P450 2C9
Ligand
BDBM50125050
Substrate
Meas. Tech.
ChEMBL_1518972 (CHEMBL3626124)
IC50
>20000±n/a nM
Citation
 Martin, REAebi, JDHornsperger, BKrebs, HJKuhn, BKuglstatter, AAlker, AMMärki, HPMüller, SBurger, DOttaviani, GRiboulet, WVerry, PTan, XAmrein, KMayweg, AV Discovery of 4-Aryl-5,6,7,8-tetrahydroisoquinolines as Potent, Selective, and Orally Active Aldosterone Synthase (CYP11B2) Inhibitors: In Vivo Evaluation in Rodents and Cynomolgus Monkeys. J Med Chem 58:8054-65 (2015)  
Target
Name:
Cytochrome P450 2C9
Synonyms:
(R)-limonene 6-monooxygenase CP2C9_HUMAN CYP2C9 Cytochrome P450 2C9 (CYP2C9 ) P-450MP P450 PB-1 | S-mephenytoin 4-hydroxylase
Type:
Enzyme
Mol. Mass.:
55636.33
Organism:
Homo sapiens (Human)
Description:
P11712
Residue:
490
  
Inhibitor
Name:
BDBM50125050
Synonyms:
CHEMBL3623831
Type:
Small organic molecule
Emp. Form.:
C19H19N3O
Mol. Mass.:
305.3737
SMILES:
CCC(=O)N[C@H]1CCCc2c1cncc2-c1ccc(cc1)C#N
: