Target
Carbonic anhydrase 12
Ligand
BDBM10880
Substrate
Meas. Tech.
ChEMBL_1519322 (CHEMBL3624913)
Ki
6.0±n/a nM
Citation
 Esirden, IUlus, RAday, BTanç, MSupuran, CTKaya, M Synthesis of novel acridine bis-sulfonamides with effective inhibitory activity against the carbonic anhydrase isoforms I, II, IX and XII. Bioorg Med Chem 23:6573-80 (2015)  
Target
Name:
Carbonic anhydrase 12
Synonyms:
CA-XII CAH12_HUMAN Carbonic anhydrase Carbonic anhydrase XII Carbonic anhydrase XII (CAXII) | Tumor antigen HOM-RCC-3.1.3
Type:
Enzyme
Mol. Mass.:
39456.00
Organism:
Homo sapiens (Human)
Description:
Catalytic domain of human cloned isozyme was used in the assay
Residue:
354
  
Inhibitor
Name:
BDBM10880
Synonyms:
AZA AZM acetazolamide Acetazolamide Acetazolamide (AZA) Acetazolamide, 5 Acetazolamide, AZA CHEMBL20 Sulfonamide, 1 US11278534, Example acetazolamide sulfonamide 1
Type:
Small organic molecule
Emp. Form.:
C4H6N4O3S2
Mol. Mass.:
222.245
SMILES:
CC(=O)Nc1nnc(s1)S(N)(=O)=O
: