Target
Carbonic anhydrase 9
Ligand
BDBM50125571
Substrate
Meas. Tech.
ChEMBL_1519321 (CHEMBL3624912)
Ki
1000±n/a nM
Citation
 Esirden, IUlus, RAday, BTanç, MSupuran, CTKaya, M Synthesis of novel acridine bis-sulfonamides with effective inhibitory activity against the carbonic anhydrase isoforms I, II, IX and XII. Bioorg Med Chem 23:6573-80 (2015)  
Target
Name:
Carbonic anhydrase 9
Synonyms:
CA-IX CAH9_HUMAN Carbonic anhydrase 9 (CA IX) Carbonic anhydrase 9 precursor Carbonic anhydrase IX (CAIX) Carbonic anhydrases; II & IX MN RCC-associated antigen G250
Type:
Enzyme
Mol. Mass.:
49669.03
Organism:
Homo sapiens (Human)
Description:
Catalytic domain of human cloned isozyme was used in the assay
Residue:
459
  
Inhibitor
Name:
BDBM50125571
Synonyms:
CHEMBL3623633
Type:
Small organic molecule
Emp. Form.:
C29H33N3O4S
Mol. Mass.:
519.655
SMILES:
CC1(C)CC(=O)C2=C(C1)N(C1=C(C2c2ccc(N)cc2)C(=O)CC(C)(C)C1)c1ccc(cc1)S(N)(=O)=O
: