Target
Protein-serine O-palmitoleoyltransferase porcupine
Ligand
BDBM50125820
Substrate
Meas. Tech.
ChEMBL_1519628 (CHEMBL3626166)
IC50
0.190000±n/a nM
Citation
 Dong, YLi, KXu, ZMa, HZheng, JHu, ZHe, SWu, YSun, ZLuo, LLi, JZhang, HZhang, X Exploration of the linkage elements of porcupine antagonists led to potent Wnt signaling pathway inhibitors. Bioorg Med Chem 23:6855-68 (2015)  
Target
Name:
Protein-serine O-palmitoleoyltransferase porcupine
Synonyms:
MG61 PORC PORCN_HUMAN Probable protein-cysteine N-palmitoyltransferase porcupine Protein-serine O-palmitoleoyltransferase porcupine
Type:
PROTEIN
Mol. Mass.:
52337.13
Organism:
Homo sapiens (Human)
Description:
ChEMBL_103574
Residue:
461
  
Inhibitor
Name:
BDBM50125820
Synonyms:
CHEMBL3623894
Type:
Small organic molecule
Emp. Form.:
C24H21N5O
Mol. Mass.:
395.4564
SMILES:
Cc1cc(ccn1)-c1ccc(CCC(=O)Nc2ccc(cn2)-c2cnccn2)cc1
: