Target
Protein-serine O-palmitoleoyltransferase porcupine
Ligand
BDBM50125831
Substrate
Meas. Tech.
ChEMBL_1519628 (CHEMBL3626166)
IC50
2.7±n/a nM
Citation
 Dong, YLi, KXu, ZMa, HZheng, JHu, ZHe, SWu, YSun, ZLuo, LLi, JZhang, HZhang, X Exploration of the linkage elements of porcupine antagonists led to potent Wnt signaling pathway inhibitors. Bioorg Med Chem 23:6855-68 (2015)  
Target
Name:
Protein-serine O-palmitoleoyltransferase porcupine
Synonyms:
MG61 PORC PORCN_HUMAN Probable protein-cysteine N-palmitoyltransferase porcupine Protein-serine O-palmitoleoyltransferase porcupine
Type:
PROTEIN
Mol. Mass.:
52337.13
Organism:
Homo sapiens (Human)
Description:
ChEMBL_103574
Residue:
461
  
Inhibitor
Name:
BDBM50125831
Synonyms:
CHEMBL3623887
Type:
Small organic molecule
Emp. Form.:
C22H15N5O2
Mol. Mass.:
381.3868
SMILES:
O=C(COc1ccc2cc(ccc2c1)C#N)Nc1ccc(cn1)-c1cnccn1
: