Target
Protein-glutamine gamma-glutamyltransferase 2
Ligand
BDBM50342583
Substrate
Meas. Tech.
ChEMBL_1523088 (CHEMBL3631665)
Ki
3300±n/a nM
Citation
 Yi, MCPalanski, BAQuintero, SAPlugis, NMKhosla, C An unprecedented dual antagonist and agonist of human Transglutaminase 2. Bioorg Med Chem Lett 25:4922-6 (2015)  
Target
Name:
Protein-glutamine gamma-glutamyltransferase 2
Synonyms:
Protein-glutamine gamma-glutamyltransferase TGM2 Tissue transglutaminase Transglutaminase 2 (TGM2) Transglutaminase-2
Type:
Protein
Mol. Mass.:
77309.30
Organism:
Homo sapiens (Human)
Description:
P21980
Residue:
687
  
Inhibitor
Name:
BDBM50342583
Synonyms:
(E)-4-chloro-3-(2-(2-methoxyphenyl)-2-oxoethylidene)indolin-2-one | CHEMBL1770521
Type:
Small organic molecule
Emp. Form.:
C17H12ClNO3
Mol. Mass.:
313.735
SMILES:
COc1ccccc1C(=O)\C=C1\C(=O)Nc2cccc(Cl)c12
: