Target
Indoleamine 2,3-dioxygenase 1
Ligand
BDBM24665
Substrate
Meas. Tech.
ChEMBL_1523460 (CHEMBL3630804)
IC50
7600±n/a nM
Citation
 Dounay, ABTuttle, JBVerhoest, PR Challenges and Opportunities in the Discovery of New Therapeutics Targeting the Kynurenine Pathway. J Med Chem 58:8762-82 (2015)  
Target
Name:
Indoleamine 2,3-dioxygenase 1
Synonyms:
I23O1_HUMAN IDO-1 INDO Indoleamine 2,3-dioxygenase | Indoleamine-pyrrole 2,3-dioxygenase
Type:
Enzyme
Mol. Mass.:
45330.80
Organism:
Homo sapiens (Human)
Description:
P14902
Residue:
403
  
Inhibitor
Name:
BDBM24665
Synonyms:
3-(1H-imidazol-4-yl)benzene-1-thiol | 3-(1H-imidazol-4-yl)benzenethiol, 17
Type:
Small organic molecule
Emp. Form.:
C9H8N2S
Mol. Mass.:
176.238
SMILES:
Sc1cccc(c1)-c1c[nH]cn1
: