Target
Kynurenine 3-monooxygenase
Ligand
BDBM50061916
Substrate
Meas. Tech.
ChEMBL_1523466 (CHEMBL3630810)
IC50
37±n/a nM
Citation
 Dounay, ABTuttle, JBVerhoest, PR Challenges and Opportunities in the Discovery of New Therapeutics Targeting the Kynurenine Pathway. J Med Chem 58:8762-82 (2015)  
Target
Name:
Kynurenine 3-monooxygenase
Synonyms:
KMO | KMO_HUMAN
Type:
PROTEIN
Mol. Mass.:
55831.03
Organism:
Homo sapiens (Human)
Description:
ChEMBL_1487479
Residue:
486
  
Inhibitor
Name:
BDBM50061916
Synonyms:
3,4-Dimethoxy-N-[4-(3-nitro-phenyl)-thiazol-2-yl]-benzenesulfonamide | CHEMBL134915
Type:
Small organic molecule
Emp. Form.:
C17H15N3O6S2
Mol. Mass.:
421.448
SMILES:
COc1ccc(cc1OC)S(=O)(=O)Nc1nc(cs1)-c1cccc(c1)[N+]([O-])=O
: