Target
Protein mono-ADP-ribosyltransferase PARP10
Ligand
BDBM50126164
Substrate
Meas. Tech.
ChEMBL_1523606 (CHEMBL3631405)
IC50
100000±n/a nM
Citation
 Morgan, RKCarter-O'Connell, ICohen, MS Selective inhibition of PARP10 using a chemical genetics strategy. Bioorg Med Chem Lett 25:4770-3 (2015)  
Target
Name:
Protein mono-ADP-ribosyltransferase PARP10
Synonyms:
2.4.2.- ADP-ribosyltransferase diphtheria toxin-like 10 Human diphtheria toxin-like ADP-ribosyltransferase (ARTD10 or PARP10, L926Y)) Human diphtheria toxin-like ADP-ribosyltransferase (ARTD10 or PARP10, S927A)) PARP-10 Poly [ADP-ribose] polymerase 10
Type:
Mol. Mass.:
109953.63
Organism:
Homo sapiens (Human)
Description:
Q53GL7
Residue:
1025
  
Inhibitor
Name:
BDBM50126164
Synonyms:
CHEMBL3416132
Type:
Small organic molecule
Emp. Form.:
C9H8ClNO
Mol. Mass.:
181.619
SMILES:
Clc1ccc2CCNC(=O)c2c1
: