Target
Neprilysin
Ligand
BDBM50024102
Substrate
Meas. Tech.
ChEMBL_1523620 (CHEMBL3631551)
Ki
5.5±n/a nM
Citation
 Poras, HBonnard, EFournié-Zaluski, MCRoques, BP Modulation of disulfide dual ENKephalinase inhibitors (DENKIs) activity by a transient N-protection for pain alleviation by oral route. Eur J Med Chem 102:58-67 (2015)  
Target
Name:
Neprilysin
Synonyms:
Atriopeptidase CD_antigen=CD10 EPN MME NEP_HUMAN Neutral endopeptidase | Neutral endopeptidase 24.11
Type:
Enzyme
Mol. Mass.:
85505.38
Organism:
Homo sapiens (Human)
Description:
P08473
Residue:
750
  
Inhibitor
Name:
BDBM50024102
Synonyms:
((S)-2-Mercaptomethyl-3-phenyl-propionylamino)-acetic acid (S) (2-Mercaptomethyl-3-phenyl-propionylamino)-acetic acid CHEMBL298827
Type:
Small organic molecule
Emp. Form.:
C12H15NO3S
Mol. Mass.:
253.317
SMILES:
OC(=O)CNC(=O)[C@@H](CS)Cc1ccccc1
: