Target
Reduced folate transporter
Ligand
BDBM50354833
Substrate
Meas. Tech.
ChEMBL_1523799 (CHEMBL3632250)
IC50
101±n/a nM
Citation
 Wang, LWallace, ARaghavan, SDeis, SMWilson, MRYang, SPolin, LWhite, KKushner, JOrr, SGeorge, CO'Connor, CHou, ZMitchell-Ryan, SDann, CEMatherly, LHGangjee, A 6-Substituted Pyrrolo[2,3-d]pyrimidine Thienoyl Regioisomers as Targeted Antifolates for Folate Receptora and the Proton-Coupled Folate Transporter in Human Tumors. J Med Chem 58:6938-59 (2015)  
Target
Name:
Reduced folate transporter
Synonyms:
FLOT1 Folate transporter 1 Intestinal folate carrier RFC Reduced folate carrier protein SLC19A1 | Solute carrier family 19 member 1
Type:
PROTEIN
Mol. Mass.:
64885.16
Organism:
Homo sapiens (Human)
Description:
ChEMBL_1469594
Residue:
591
  
Inhibitor
Name:
BDBM50354833
Synonyms:
AGF94 | CHEMBL1834488
Type:
Small organic molecule
Emp. Form.:
C19H21N5O6S
Mol. Mass.:
447.465
SMILES:
Nc1nc2[nH]c(CCCc3ccc(s3)C(=O)N[C@@H](CCC(O)=O)C(O)=O)cc2c(=O)[nH]1
: