Target
DNA gyrase subunit B
Ligand
BDBM50126836
Substrate
Meas. Tech.
ChEMBL_1523962 (CHEMBL3630319)
IC50
22310±n/a nM
Citation
 Medapi, BSuryadevara, PRenuka, JSridevi, JPYogeeswari, PSriram, D 4-Aminoquinoline derivatives as novel Mycobacterium tuberculosis GyrB inhibitors: Structural optimization, synthesis and biological evaluation. Eur J Med Chem 103:1-16 (2015)  
Target
Name:
DNA gyrase subunit B
Synonyms:
GYRB_MYCSM | gyrB
Type:
PROTEIN
Mol. Mass.:
74505.25
Organism:
Mycobacterium smegmatis
Description:
ChEMBL_107961
Residue:
675
  
Inhibitor
Name:
BDBM50126836
Synonyms:
CHEMBL3628352
Type:
Small organic molecule
Emp. Form.:
C26H32N4O4
Mol. Mass.:
464.5567
SMILES:
CCOC(=O)c1cnc2ccc(OC)cc2c1Nc1ccc(NCCCN2CCOCC2)cc1
: