Target
17-beta-hydroxysteroid dehydrogenase type 1
Ligand
BDBM50330988
Substrate
Meas. Tech.
ChEMBL_1524155 (CHEMBL3631240)
IC50
69±n/a nM
Citation
 Abdelsamie, ASBey, EGargano, EMvan Koppen, CJEmpting, MFrotscher, M Towards the evaluation in an animal disease model: Fluorinated 17ß-HSD1 inhibitors showing strong activity towards both the human and the rat enzyme. Eur J Med Chem 103:56-68 (2015)  
Target
Name:
17-beta-hydroxysteroid dehydrogenase type 1
Synonyms:
17-beta-HSD 1 17-beta-hydroxysteroid dehydrogenase type 1 20-alpha-HSD E17KSR EDH17B1 EDHB17 Estradiol 17-beta-dehydrogenase 1 (17beta-HSD1) Placental 17-beta-hydroxysteroid dehydrogenase | SDR28C1
Type:
Enzyme
Mol. Mass.:
34945.13
Organism:
Homo sapiens (Human)
Description:
P14061
Residue:
328
  
Inhibitor
Name:
BDBM50330988
Synonyms:
(3-hydroxyphenyl)(5-(3-hydroxyphenyl)thiophen-2-yl)methanone | CHEMBL1277249
Type:
Small organic molecule
Emp. Form.:
C17H12O3S
Mol. Mass.:
296.34
SMILES:
Oc1cccc(c1)C(=O)c1ccc(s1)-c1cccc(O)c1
: