Target
17-beta-hydroxysteroid dehydrogenase type 2
Ligand
BDBM50126986
Substrate
Meas. Tech.
ChEMBL_1524156 (CHEMBL3631241)
IC50
88±n/a nM
Citation
 Abdelsamie, ASBey, EGargano, EMvan Koppen, CJEmpting, MFrotscher, M Towards the evaluation in an animal disease model: Fluorinated 17ß-HSD1 inhibitors showing strong activity towards both the human and the rat enzyme. Eur J Med Chem 103:56-68 (2015)  
Target
Name:
17-beta-hydroxysteroid dehydrogenase type 2
Synonyms:
17-beta-Hydroxysteroid Dehydrogenase 2 (17-beta-HSD2) 20-alpha-HSD EDH17B2 Estradiol 17-beta-dehydrogenase 2 (17beta-HSD2) Microsomal 17-beta-hydroxysteroid dehydrogenas Testosterone 17-beta-dehydrogenase
Type:
Oxidoreductase; single-pass type II membrane protein
Mol. Mass.:
42795.29
Organism:
Homo sapiens (Human)
Description:
Enzyme was partially purified from human placenta.
Residue:
387
  
Inhibitor
Name:
BDBM50126986
Synonyms:
CHEMBL3629442
Type:
Small organic molecule
Emp. Form.:
C23H17NO5S2
Mol. Mass.:
451.515
SMILES:
Oc1cccc(c1)C(=O)c1ccc(s1)-c1cccc(NS(=O)(=O)c2cccc(O)c2)c1
: