Target
Mitogen-activated protein kinase 1
Ligand
BDBM50127013
Substrate
Meas. Tech.
ChEMBL_1524687 (CHEMBL3631081)
Kd
319000±n/a nM
Citation
 Burdick, DJWang, SHeise, CPan, BDrummond, JYin, JGoeser, LMagnuson, SBlaney, JMoffat, JWang, WChen, H Fragment-based discovery of potent ERK2 pyrrolopyrazine inhibitors. Bioorg Med Chem Lett 25:4728-32 (2015)  
Target
Name:
Mitogen-activated protein kinase 1
Synonyms:
ERK2 Extracellular signal-regulated kinase 2 Extracellular signal-regulated kinase 2 (ERK2) MAPK 2 MK01_HUMAN Mitogen-activated protein kinase 1 (ERK-2) Mitogen-activated protein kinase 2 PRKM2 | p42-MAPK
Type:
Ser/Thr Protein Kinase
Mol. Mass.:
41392.76
Organism:
Homo sapiens (Human)
Description:
P28482
Residue:
360
  
Inhibitor
Name:
BDBM50127013
Synonyms:
CHEMBL3628247
Type:
Small organic molecule
Emp. Form.:
C6H4BrN3
Mol. Mass.:
198.02
SMILES:
Brc1cnc2[nH]ccc2n1
: