Target
Mitogen-activated protein kinase 1
Ligand
BDBM50127031
Substrate
Meas. Tech.
ChEMBL_1524688 (CHEMBL3631082)
IC50
5900±n/a nM
Citation
 Burdick, DJWang, SHeise, CPan, BDrummond, JYin, JGoeser, LMagnuson, SBlaney, JMoffat, JWang, WChen, H Fragment-based discovery of potent ERK2 pyrrolopyrazine inhibitors. Bioorg Med Chem Lett 25:4728-32 (2015)  
Target
Name:
Mitogen-activated protein kinase 1
Synonyms:
ERK2 Extracellular signal-regulated kinase 2 Extracellular signal-regulated kinase 2 (ERK2) MAPK 2 MK01_HUMAN Mitogen-activated protein kinase 1 (ERK-2) Mitogen-activated protein kinase 2 PRKM2 | p42-MAPK
Type:
Ser/Thr Protein Kinase
Mol. Mass.:
41392.76
Organism:
Homo sapiens (Human)
Description:
P28482
Residue:
360
  
Inhibitor
Name:
BDBM50127031
Synonyms:
CHEMBL3628361
Type:
Small organic molecule
Emp. Form.:
C9H7N5
Mol. Mass.:
185.1854
SMILES:
c1cc2nc(cnc2[nH]1)-c1cn[nH]c1
: