Target
Acetylcholinesterase
Ligand
BDBM50127389
Substrate
Meas. Tech.
ChEMBL_1522395 (CHEMBL3631132)
IC50
530±n/a nM
Citation
 Luo, XTWang, CMLiu, YHuang, ZG New multifunctional melatonin-derived benzylpyridinium bromides with potent cholinergic, antioxidant, and neuroprotective properties as innovative drugs for Alzheimer's disease. Eur J Med Chem 103:302-11 (2015)  
Target
Name:
Acetylcholinesterase
Synonyms:
ACES_HUMAN Acetylcholinesterase (AChE) | Acetylcholinesterase (human AChE)
Type:
Enzyme
Mol. Mass.:
67792.70
Organism:
Homo sapiens (Human)
Description:
P22303
Residue:
614
  
Inhibitor
Name:
BDBM50127389
Synonyms:
CHEMBL3628184
Type:
Small organic molecule
Emp. Form.:
C26H27BrFN3O2
Mol. Mass.:
512.414
SMILES:
[Br-].COc1ccc2[nH]cc(CCNC(=O)CCc3cc[n+](Cc4ccccc4F)cc3)c2c1
: