Target
Genome polyprotein
Ligand
BDBM50127568
Substrate
Meas. Tech.
ChEMBL_1522415 (CHEMBL3631310)
IC50
3850±n/a nM
Citation
 Weigel, LFNitsche, CGraf, DBartenschlager, RKlein, CD Phenylalanine and Phenylglycine Analogues as Arginine Mimetics in Dengue Protease Inhibitors. J Med Chem 58:7719-33 (2015)  
Target
Name:
Genome polyprotein
Synonyms:
POLG_WNV | polyprotein precursor
Type:
PROTEIN
Mol. Mass.:
380170.63
Organism:
West Nile virus
Description:
ChEMBL_1438217
Residue:
3430
  
Inhibitor
Name:
BDBM50127568
Synonyms:
CHEMBL3628265
Type:
Small organic molecule
Emp. Form.:
C32H38N6O5
Mol. Mass.:
586.6813
SMILES:
CC(=O)Nc1ccc(C[C@H](NC(=O)c2ccccc2)C(=O)N[C@@H](CCCCN)C(=O)N[C@H](C(N)=O)c2ccccc2)cc1
: