Target
Beta-galactoside alpha-2,6-sialyltransferase 1
Ligand
BDBM50127707
Substrate
Meas. Tech.
ChEMBL_1522838 (CHEMBL3630397)
Ki
4314±n/a nM
Citation
 Li, WNiu, YXiong, DCCao, XYe, XS Highly Substituted Cyclopentane-CMP Conjugates as Potent Sialyltransferase Inhibitors. J Med Chem 58:7972-90 (2015)  
Target
Name:
Beta-galactoside alpha-2,6-sialyltransferase 1
Synonyms:
Alpha 2,6-ST 1 Beta-galactoside alpha-2,6-sialyltransferase 1 SIAT1 ST6GAL1 ST6GalI | Sialyltransferase 1
Type:
PROTEIN
Mol. Mass.:
46622.19
Organism:
Homo sapiens (Human)
Description:
ChEMBL_109837
Residue:
406
  
Inhibitor
Name:
BDBM50127707
Synonyms:
CHEMBL3629691
Type:
Small organic molecule
Emp. Form.:
C17H25N4Na3O13P2
Mol. Mass.:
624.3162
SMILES:
[Na+].[Na+].[Na+].[H][C@]1(C[C@@H](O)[C@H](C1)NC(C)=O)C(OP([O-])(=O)OC[C@H]1O[C@H]([C@H](O)[C@@H]1O)n1ccc(N)nc1=O)P([O-])([O-])=O
: