Target
cGMP-inhibited 3',5'-cyclic phosphodiesterase 3B
Ligand
BDBM50128272
Substrate
Meas. Tech.
ChEMBL_1523331 (CHEMBL3630142)
IC50
3480±n/a nM
Citation
 Li, JZhang, XJin, HFan, JFlores, HPerlmutter, JSTu, Z Synthesis of Fluorine-Containing Phosphodiesterase 10A (PDE10A) Inhibitors and the In Vivo Evaluation of F-18 Labeled PDE10A PET Tracers in Rodent and Nonhuman Primate. J Med Chem 58:8584-600 (2015)  
Target
Name:
cGMP-inhibited 3',5'-cyclic phosphodiesterase 3B
Synonyms:
CGI-PDE B CGIPDE1 PDE3B Phosphodiesterase 3B Phosphodiesterase Type 3 (PDE3B) cGMP-inhibited 3,5-cyclic phosphodiesterase B
Type:
Enzyme
Mol. Mass.:
124318.95
Organism:
Homo sapiens (Human)
Description:
PDE3B was generated from the full-length recombinant human clone transfected into Sf9 cells.
Residue:
1112
  
Inhibitor
Name:
BDBM50128272
Synonyms:
CHEMBL3628721
Type:
Small organic molecule
Emp. Form.:
C27H24FN5O
Mol. Mass.:
453.5108
SMILES:
Cn1cc(c(n1)-c1ccc(OCc2cc(NCCF)c3ccccc3n2)cc1)-c1ccncc1
: