Target
Mitogen-activated protein kinase kinase kinase 12
Ligand
BDBM50128338
Substrate
Meas. Tech.
ChEMBL_1523511 (CHEMBL3631015)
Ki
25±n/a nM
Citation
 Patel, SHarris, SFGibbons, PDeshmukh, GGustafson, AKellar, TLin, HLiu, XLiu, YLiu, YMa, CScearce-Levie, KGhosh, ASShin, YGSolanoy, HWang, JWang, BYin, JSiu, MLewcock, JW Scaffold-Hopping and Structure-Based Discovery of Potent, Selective, And Brain Penetrant N-(1H-Pyrazol-3-yl)pyridin-2-amine Inhibitors of Dual Leucine Zipper Kinase (DLK, MAP3K12). J Med Chem 58:8182-99 (2015)  
Target
Name:
Mitogen-activated protein kinase kinase kinase 12
Synonyms:
DLK Leucine-zipper protein kinase MAP3K12 MUK Mixed lineage kinase | ZPK
Type:
PROTEIN
Mol. Mass.:
93216.56
Organism:
Homo sapiens (Human)
Description:
ChEMBL_1460553
Residue:
859
  
Inhibitor
Name:
BDBM50128338
Synonyms:
CHEMBL3629019
Type:
Small organic molecule
Emp. Form.:
C21H26N6O
Mol. Mass.:
378.4707
SMILES:
N#Cc1ccnc(Nc2cc(C3CCN(C3)C3COC3)n(n2)C2CCCC2)c1
: