Target
Tumor necrosis factor ligand superfamily member 11
Ligand
BDBM50128344
Substrate
Meas. Tech.
ChEMBL_1523723 (CHEMBL3631862)
IC50
580±n/a nM
Citation
 Kang, JHTing, ZMoon, MRSim, JSLee, JMDoh, KEHong, SCui, MChoi, SChang, HWPark Choo, HYYim, M 5-Lipoxygenase inhibitors suppress RANKL-induced osteoclast formation via NFATc1 expression. Bioorg Med Chem 23:7069-78 (2015)  
Target
Name:
Tumor necrosis factor ligand superfamily member 11
Synonyms:
CD_antigen=CD254 Opgl Osteoprotegerin ligand Receptor activator of nuclear factor kappa-B ligand TNF11_MOUSE Trance Tumor necrosis factor ligand superfamily member 11, soluble form
Type:
PROTEIN
Mol. Mass.:
35008.20
Organism:
Mus musculus
Description:
ChEMBL_109846
Residue:
316
  
Inhibitor
Name:
BDBM50128344
Synonyms:
CHEMBL3629177
Type:
Small organic molecule
Emp. Form.:
C26H27N5O5
Mol. Mass.:
489.5231
SMILES:
COc1ccc(Nc2nc3cc(NC(=O)CCCCOc4ccc(cc4)C(\N)=N\O)ccc3o2)cc1
: