Target
Procathepsin L
Ligand
BDBM50128811
Substrate
Meas. Tech.
ChEMBL_1522723 (CHEMBL3629949)
IC50
24±n/a nM
Citation
 Parker, ENSong, JKishore Kumar, GDOdutola, SOChavarria, GECharlton-Sevcik, AKStrecker, TEBarnes, ALSudhan, DRWittenborn, TRSiemann, DWHorsman, MRChaplin, DJTrawick, MLPinney, KG Synthesis and biochemical evaluation of benzoylbenzophenone thiosemicarbazone analogues as potent and selective inhibitors of cathepsin L. Bioorg Med Chem 23:6974-92 (2015)  
Target
Name:
Procathepsin L
Synonyms:
CATL1_HUMAN CTSL CTSL1 Cathepsin L Cathepsin L1 heavy chain MEP cathepsin L preproprotein
Type:
Enzyme
Mol. Mass.:
37557.19
Organism:
Homo sapiens (Human)
Description:
Purchased from Calbiochem (San Diego, CA).
Residue:
333
  
Inhibitor
Name:
BDBM50128811
Synonyms:
CHEMBL3629193
Type:
Small organic molecule
Emp. Form.:
C21H19N3OS
Mol. Mass.:
361.46
SMILES:
NC(=S)N\N=C(/c1ccccc1)c1cccc(c1)C(O)c1ccccc1
: