Target
Transient receptor potential cation channel subfamily V member 1
Ligand
BDBM50128922
Substrate
Meas. Tech.
ChEMBL_1522885 (CHEMBL3630758)
Ki
0.030000±n/a nM
Citation
 Ann, JJung, AKim, MYKim, HMRyu, HKim, SKang, DWHong, SCui, MChoi, SBlumberg, PMFrank-Foltyn, RBahrenberg, GStockhausen, HChristoph, TLee, J Structure activity relationships of benzyl C-region analogs of 2-(3-fluoro-4-methylsulfonamidophenyl)propanamides as potent TRPV1 antagonists. Bioorg Med Chem 23:6844-54 (2015)  
Target
Name:
Transient receptor potential cation channel subfamily V member 1
Synonyms:
Capsaicin receptor Osm-9-like TRP channel 1 TRPV1_HUMAN Transient receptor potential cation channel subfamily V member 1 (TRPV1) Transient receptor potential cation channel subfamily V member 1(TRPV1) Vanilloid VR1 Vanilloid receptor 1 Vanilloid receptor 1 (VRI/TRPV1)
Type:
Protein
Mol. Mass.:
94960.75
Organism:
Homo sapiens (Human)
Description:
Q8NER1
Residue:
839
  
Inhibitor
Name:
BDBM50128922
Synonyms:
CHEMBL3627950
Type:
Small organic molecule
Emp. Form.:
C23H26F4N2O3S2
Mol. Mass.:
518.588
SMILES:
CC(C(=O)NCc1ccc(cc1SC1CCCC1)C(F)(F)F)c1ccc(NS(C)(=O)=O)c(F)c1
: